{"text_format":"3","workbook":"xlsx","n_sheets":5,"sheets":["Read ME","Risk Register","Dashboard","Definitions","Validation"],"not_rendered":{"charts":4,"images":1,"external_links":1,"defined_names":15},"read":"whole","date_system":"1900"}

{"sheet":"Read ME","index":0,"n_rows":15,"n_cols":1,"rows_kept":15}
["Please Read"]
[]
["Dear User, thank you for using my template."]
[]
["You downloaded this Excel template free of charge from "]
["http://project-management.magt.biz"]
["You may use it for your personal use and the projects you manage. However, selling the template or offering it for download on your own website are strictly prohibited.\nI hope you like my templates and would be happy if you would share my website link on Facebook, Twitter etc. and return to my website to check for further templates and leave a comment with your improvement suggestions."]
[]
["The Risk Register containa a few sample entries. Please delete/overwrite those entries."]
[]
["Make entries only in cells with blue font-color / italic font"]
[]
["If you want to add rows to the register mark any cell in the last line and press the \"TAB\" key repeatedly until a new line is added. Alternatively you can just start typing in the first column of the first empty row under the last register entry.\nFormulas and formats are copied down automatically. The dashboard updates automatically."]
[]
["Entries to some register columns are limited. Please check/update the sheet \"Validation\" prior to using the register for the first time. Later changes to the Validation sheet while the register is actually in use should be avoided, or otherwise entries to the Validation tables may be added, but existing values shouldn't be deleted or altered."]
{"$rows_left_out":1}
{"sheet":"Risk Register","index":1,"n_rows":23,"n_cols":17,"rows_kept":23,"merged":[[0,0,0,1],[0,2,0,4],[0,14,0,15],[1,0,1,1],[1,2,1,4],[1,14,1,15],[2,0,2,5],[2,6,2,10],[2,11,2,13],[2,14,2,16]]}
["Project Name:",null,"[Project Name]",{"$nulls":11},"Last Updated Date:",null,"[last updated]"]
["Project Manager:",null,"[Project Manager]",{"$nulls":11},"Last Updated by:",null,"[updated by]"]
["Identification",{"$nulls":5},"Assessment",{"$nulls":4},"Strategy",null,null,"Monitoring"]
["#","Category","Opportunity or Threat","Risk Name","Risk Description","Risk Related to Activity","Probability","Impact","Severity","Estimated Monetary Value - EMV (USD)","Schedule Impact (WD)","Response Strategy","Strategy Description","Risk Owner","Status","Lat Update","Comments"]
[{"v":1,"d":"001"},"Design","Threat (T)","Design Risk","Inadequate design or wrong assumptions, could make the product fail and unsuitable for intended purpose.","all",1,5,{"$f":"Risk_Register[[#This Row],[Probability]]*Risk_Register[[#This Row],[Impact]]*(ROW()/(ROW()-0.01))","v":{"v":5.0100200400801596,"d":"5.010"}},{"v":10000,"d":"10,000"},2,"Accept (T&O)","[company] is not the product designer nor the reviewer and thus has little influence on the risk.",null,"Inactive","2017-09-14"]
[{"v":2,"d":"002"},"Construction","Threat (T)","Supplier or Sub-Contractor incapable","Contractor, sub-contractor or supplier incapable to follow construction specifications, requirements or expectations resulting in delays and consequently cost overruns.","all",1,3,{"$f":"Risk_Register[[#This Row],[Probability]]*Risk_Register[[#This Row],[Impact]]*(ROW()/(ROW()-0.01))","v":{"v":3.005008347245409,"d":"3.005"}},{"v":20000,"d":"20,000"},3,"Mitigate (T)","Monitor performance and have alternative solution (plan B).","PM, Procurement","Inactive","2017-09-14"]
[{"v":3,"d":"003"},"Construction","Threat (T)","Technical Factors","Changes in work process or work package sequence, gaps between theory and actual work QTYs, could lead to schedule and consequently cost impacts.","all",2,4,{"$f":"Risk_Register[[#This Row],[Probability]]*Risk_Register[[#This Row],[Impact]]*(ROW()/(ROW()-0.01))","v":{"v":8.011444921316166,"d":"8.011"}},{"v":30000,"d":"30,000"},4,"Mitigate (T)","It is a matter of fact that many locations cannot be worked on due to pending community compensation by KETRACO). Thus the risk became rather an issue. [company] tracks and records the impact and claims for it.\nQTYs are not a risk due to type of contract (measurable).","PM, Constr. Mngr.","Active","2017-09-14"]
[{"v":4,"d":"004"},"Construction","Threat (T)","Site and layout conditions","Interruptions in site access and interference in the flow of work could result in delays and consequently additional cost.","all",2,2,{"$f":"Risk_Register[[#This Row],[Probability]]*Risk_Register[[#This Row],[Impact]]*(ROW()/(ROW()-0.01))","v":{"v":4.005006257822278,"d":"4.005"}},{"v":40000,"d":"40,000"},5,"Mitigate (T)","Similar to risk no. 3 above this is not anymore a risk, but rather an issue and triggered severally when communities blocked access to the work site. [company] has very little influence and can only track and record the impact in order to claim the extra cost.\n[company] on their site are in contact with the communities and keep them informed about the ongoing works.","PM, HSSE Mngr., Constr. Mngr.","Active","2017-09-14"]
[{"v":5,"d":"005"},"Construction","Threat (T)","Physical Factors","Topography, unforeseen subsurface conditions, ground water, rocks, material unsuitability and other conditions could require extra effort and would consequently have cost and probably time impact.","Excavating, backfilling",1,2,{"$f":"Risk_Register[[#This Row],[Probability]]*Risk_Register[[#This Row],[Impact]]*(ROW()/(ROW()-0.01))","v":{"v":2.0022246941045605,"d":"2.002"}},{"v":50000,"d":"50,000"},6,"Mitigate (T)","Similar to risk no. 3 above this is not anymore a risk, but rather an issue.\nIn accordance with pre-contract information only a small number foundations would require rock excavating. The reality proves different. Extra rates apply.","PM, Constr. Mngr.","Active","2017-09-14"]
[{"v":6,"d":"006"},"Construction","Threat (T)","Security factors","Corruption, theft, vandalism, sabotage, can cause extra cost and may have schedule impact.","all",4,3,{"$f":"Risk_Register[[#This Row],[Probability]]*Risk_Register[[#This Row],[Impact]]*(ROW()/(ROW()-0.01))","v":{"v":12.012012012012013,"d":"12.012"}},{"v":60000,"d":"60,000"},7,"Transfer (T)","Similar to risk no. 3 above this is not anymore a risk, but rather an issue an triggered severally.\n[company] employed security personal to safe guard material and equipment at site.\nInsurrances are in place.","PM, HSSE Mngr., Constr. Mngr.","Active","2017-09-14"]
[{"v":7,"d":"007"},"Construction","Threat (T)","Procurement Factors","Insolvency of a party or inadequate change introduction can impact the schedule and cost of works execution.","all",1,5,{"$f":"Risk_Register[[#This Row],[Probability]]*Risk_Register[[#This Row],[Impact]]*(ROW()/(ROW()-0.01))","v":{"v":5.004549590536852,"d":"5.005"}},{"v":70000,"d":"70,000"},8,"Accept (T&O)","Similar to risk no. 3 above this is not anymore a risk, but rather an issue an triggered.\n[company] has no influence on other party insolvency and henceforth can only accept the risk.","PM, Project Sponsor","Active","2017-09-14","It seems recommendable to check for availability of insurance that covers this particular risk in the future."]
[{"v":8,"d":"008"},"Construction","Threat (T)","Performance factors","Defective works, labor disputes, inefficient productivity, can hinder the progress and thus have schedule and consequently cost impact.","all",2,1,{"$f":"Risk_Register[[#This Row],[Probability]]*Risk_Register[[#This Row],[Impact]]*(ROW()/(ROW()-0.01))","v":{"v":2.0016680567139282,"d":"2.002"}},{"v":80000,"d":"80,000"},9,"Mitigate (T)","Defects are unavoidalbe given the number of 1160 foundations. Inspection prior concreteing and supervision while executing activities mitigates the probability.\nLabour disputes have arisen already and where hard to forecast since such disputes in the particular work environment arise from nothing and are usually unreasonable and unlegal. HR department is aware and is in contact with the workers on the ground and communicates changes and the like timely and frequently in advance.","PM, HR Deptm.","Active","2017-09-14"]
[{"v":9,"d":"009"},"External","Threat (T)","Contractual factors","Client’s requirements and expectations higher than documented and weak definition of objectives, can result in extra effort and consequently have cost and possibly schedule impact.","all",1,4,{"$f":"Risk_Register[[#This Row],[Probability]]*Risk_Register[[#This Row],[Impact]]*(ROW()/(ROW()-0.01))","v":{"v":4.003079291762894,"d":"4.003"}},{"v":90000,"d":"90,000"},10,"Mitigate (T)","Changes to requirements, expetations as well as scope of works shall be analyzed and transferred to the change control board for decision and may rsult in change request(s).","PM","Inactive","2017-09-14"]
[{"v":10,"d":"010"},"External","Threat (T)","Force majeure factors","Unforeseen market changes, economic and political instability, adverse weather conditions, and similar unforeseeable events could lead to disruptions, delays and consequently cost impact.","all",1,5,{"$f":"Risk_Register[[#This Row],[Probability]]*Risk_Register[[#This Row],[Impact]]*(ROW()/(ROW()-0.01))","v":{"v":5.003573981415297,"d":"5.004"}},{"v":100000,"d":"100,000"},11,"Accept (T&O)","There is literaly nothing that can be done to mitigate force majeur events and [company] therefore only can accept the risk.","PM, Project Sponsor","Inactive","2017-09-14"]
[{"v":11,"d":"011"},"External","Threat (T)","Social factors","Competing interests between project and community, culture and habits, citizens rejecting the project, and similar root causes could have an impact on the project including schedule and cost.","all",1,3,{"$f":"Risk_Register[[#This Row],[Probability]]*Risk_Register[[#This Row],[Impact]]*(ROW()/(ROW()-0.01))","v":{"v":3.0020013342228156,"d":"3.002"}},{"v":110000,"d":"110,000"},12,"Accept (T&O)","It is the responisbility of the client to deal with the communities ('expanded' shareholder) in this regard and to find solutions to their demands, to compensate them for the negative impact the project may have to their land, culture and the like.\n[company] on their part are in contact with the community leaders and keeps them informed about their works.","PM, HR Deptm.","Active","2017-09-14"]
{"$rows_left_out":9}
{"sheet":"Dashboard","index":2,"n_rows":26,"n_cols":13,"rows_kept":26,"merged":[[0,0,0,1],[0,4,0,7],[0,10,0,11],[14,6,14,12],[15,7,15,10]]}
["Entries in Register",null,{"$f":"COUNT(Risk_Register['#])","v":19},null,{"$f":"Risk_Register[[#Headers],[Estimated Monetary Value - EMV (USD)]]","v":"Estimated Monetary Value - EMV (USD)"},{"$nulls":3},{"$f":"SUM(Risk_Register[Estimated Monetary Value - EMV (USD)])","v":{"v":1900000,"d":"1,900,000"}},null,{"$f":"Risk_Register[[#Headers],[Schedule Impact (WD)]]","v":"Schedule Impact (WD)"},null,{"$f":"SUM([1]Register!H:H)","v":25}]
[]
[{"$f":"IF(Validation!I2=\"\",\"\",Validation!I2)","v":"Inactive"},{"$f":"IFERROR(COUNTIF(Risk_Register[Status],Dashboard!A3),\"\")","v":7},null,null,{"$f":"IF(Validation!A2=\"\",\"\",Validation!A2)","v":"Business"},null,null,{"$f":"IFERROR(COUNTIF(Risk_Register[Category],Dashboard!E3),\"\")","v":4},null,null,{"$f":"IF(Validation!C2=\"\",\"\",Validation!C2)","v":"Opportunity (O)"},{"$f":"COUNTIF(Risk_Register[Opportunity or Threat],Dashboard!K3)","v":0}]
[{"$f":"IF(Validation!I3=\"\",\"\",Validation!I3)","v":"Accelerating"},{"$f":"IFERROR(COUNTIF(Risk_Register[Status],Dashboard!A4),\"\")","v":1},null,null,{"$f":"IF(Validation!A3=\"\",\"\",Validation!A3)","v":"Community"},null,null,{"$f":"IFERROR(COUNTIF(Risk_Register[Category],Dashboard!E4),\"\")","v":0},null,null,{"$f":"IF(Validation!C3=\"\",\"\",Validation!C3)","v":"Threat (T)"},{"$f":"COUNTIF(Risk_Register[Opportunity or Threat],Dashboard!K4)","v":19}]
[{"$f":"IF(Validation!I4=\"\",\"\",Validation!I4)","v":"Active"},{"$f":"IFERROR(COUNTIF(Risk_Register[Status],Dashboard!A5),\"\")","v":11},null,null,{"$f":"IF(Validation!A4=\"\",\"\",Validation!A4)","v":"Construction"},null,null,{"$f":"IFERROR(COUNTIF(Risk_Register[Category],Dashboard!E5),\"\")","v":7},null,null,{"$f":"IF(Validation!C4=\"\",\"\",Validation!C4)","v":"Both (T&O)"},{"$f":"COUNTIF(Risk_Register[Opportunity or Threat],Dashboard!K5)","v":0}]
[{"$f":"IF(Validation!I5=\"\",\"\",Validation!I5)","v":"Ceased"},{"$f":"IFERROR(COUNTIF(Risk_Register[Status],Dashboard!A6),\"\")","v":0},null,null,{"$f":"IF(Validation!A5=\"\",\"\",Validation!A5)","v":"Design"},null,null,{"$f":"IFERROR(COUNTIF(Risk_Register[Category],Dashboard!E6),\"\")","v":1},null,null,{"$f":"IF(Validation!C5=\"\",\"\",Validation!C5)","v":""},{"$f":"COUNTIF(Risk_Register[Opportunity or Threat],Dashboard!K6)","v":0}]
[{"$f":"IF(Validation!I6=\"\",\"\",Validation!I6)","v":""},{"$f":"IFERROR(COUNTIF(Risk_Register[Status],Dashboard!A7),\"\")","v":0},null,null,{"$f":"IF(Validation!A6=\"\",\"\",Validation!A6)","v":"Environment"},null,null,{"$f":"IFERROR(COUNTIF(Risk_Register[Category],Dashboard!E7),\"\")","v":0},null,null,{"$f":"IF(Validation!C6=\"\",\"\",Validation!C6)","v":""},{"$f":"COUNTIF(Risk_Register[Opportunity or Threat],Dashboard!K7)","v":0}]
[{"$f":"IF(Validation!I7=\"\",\"\",Validation!I7)","v":""},{"$f":"IFERROR(COUNTIF(Risk_Register[Status],Dashboard!A8),\"\")","v":0},null,null,{"$f":"IF(Validation!A7=\"\",\"\",Validation!A7)","v":"External"},null,null,{"$f":"IFERROR(COUNTIF(Risk_Register[Category],Dashboard!E8),\"\")","v":5},null,null,{"$f":"IF(Validation!C7=\"\",\"\",Validation!C7)","v":""},{"$f":"COUNTIF(Risk_Register[Opportunity or Threat],Dashboard!K8)","v":0}]
[{"$f":"IF(Validation!I8=\"\",\"\",Validation!I8)","v":""},{"$f":"IFERROR(COUNTIF(Risk_Register[Status],Dashboard!A9),\"\")","v":0},null,null,{"$f":"IF(Validation!A8=\"\",\"\",Validation!A8)","v":"Health & Safety"},null,null,{"$f":"IFERROR(COUNTIF(Risk_Register[Category],Dashboard!E9),\"\")","v":0},null,null,{"$f":"IF(Validation!C8=\"\",\"\",Validation!C8)","v":""},{"$f":"COUNTIF(Risk_Register[Opportunity or Threat],Dashboard!K9)","v":0}]
[{"$f":"IF(Validation!I9=\"\",\"\",Validation!I9)","v":""},{"$f":"IFERROR(COUNTIF(Risk_Register[Status],Dashboard!A10),\"\")","v":0},null,null,{"$f":"IF(Validation!A9=\"\",\"\",Validation!A9)","v":"Logistics"},null,null,{"$f":"IFERROR(COUNTIF(Risk_Register[Category],Dashboard!E10),\"\")","v":0},null,null,{"$f":"IF(Validation!C9=\"\",\"\",Validation!C9)","v":""},{"$f":"COUNTIF(Risk_Register[Opportunity or Threat],Dashboard!K10)","v":0}]
[{"$f":"IF(Validation!I10=\"\",\"\",Validation!I10)","v":""},{"$f":"IFERROR(COUNTIF(Risk_Register[Status],Dashboard!A11),\"\")","v":0},null,null,{"$f":"IF(Validation!A10=\"\",\"\",Validation!A10)","v":"Organizational"},null,null,{"$f":"IFERROR(COUNTIF(Risk_Register[Category],Dashboard!E11),\"\")","v":1},null,null,{"$f":"IF(Validation!C10=\"\",\"\",Validation!C10)","v":""},{"$f":"COUNTIF(Risk_Register[Opportunity or Threat],Dashboard!K11)","v":0}]
[{"$f":"IF(Validation!I11=\"\",\"\",Validation!I11)","v":""},{"$f":"IFERROR(COUNTIF(Risk_Register[Status],Dashboard!A12),\"\")","v":0},null,null,{"$f":"IF(Validation!A11=\"\",\"\",Validation!A11)","v":"Project Management"},null,null,{"$f":"IFERROR(COUNTIF(Risk_Register[Category],Dashboard!E12),\"\")","v":1},null,null,{"$f":"IF(Validation!C11=\"\",\"\",Validation!C11)","v":""},{"$f":"COUNTIF(Risk_Register[Opportunity or Threat],Dashboard!K12)","v":0}]
[]
[]
[{"$f":"Definitions!B2","v":"Low (1 / -1)"},{"$f":"COUNTIF(Risk_Register[Probability],1)+COUNTIF(Risk_Register[Probability],-1)","v":15},{"$f":"COUNTIF(Risk_Register[Impact],1)+COUNTIF(Risk_Register[Impact],-1)","v":5},{"$nulls":3},"10 Risks with Highest Severity Ranking"]
{"$rows_left_out":12}
{"sheet":"Definitions","index":3,"n_rows":30,"n_cols":6,"rows_kept":30,"merged":[[0,0,0,5],[4,0,4,5],[11,0,11,5],[12,1,12,5],[13,1,13,5],[14,1,14,5],[15,1,15,5],[16,1,16,5],[17,1,17,5],[18,1,18,5],[19,1,19,5],[20,1,20,5],[21,1,21,5],[22,1,22,5],[23,1,23,5],[25,0,25,5],[26,1,26,5],[27,1,27,5],[28,1,28,5],[29,1,29,5]]}
["Probability Rating"]
[null,"Low (1 / -1)","Med.-Low (2 / -2)","Medium (3 / -3)","Med.-High (4 / -4","High (5 / -5)"]
["Probability of occurrence","1-20%","21-40%","41-60%","61-80%","81-99%"]
[]
["Impact Rating"]
[null,{"$f":"B2","v":"Low (1 / -1)"},{"$f":"C2","v":"Med.-Low (2 / -2)"},"Medium (3 / -3)","Med.-High (4 / -4","High (5 / -5)"]
["Quality","- Negligible impacts to design quality\n- Negligible impacts to long-term maintenance\n- Barely noticeable","- Requires Design Variance,\n- Minor impacts to long-term maintenance,\n- Minor scope reduction","- Requires Design waiver,\n- Significant impacts to long-term maintenance,\n- Major scope reduction","- Does not meet acceptable standards and requires Design Exception,\n- Major impacts to long-term maintenance,\n- Changes unacceptable to stakeholders,","- Does not meet acceptable standards and Design Exception not likely,\n- Unacceptable impacts to long-term maintenance,\n- Project does not meet need and purpose"]
["Cost\n(% of total project cost)","cost increase = 1%"," cost increase = 2%","cost increase = 3%","cost increase = 4%","cost increase > 5%"]
["Schedule\n(% of of total project duration)","delay = 1%","delay = 2%","delay = 3%","delay = 4%","delay > 5%"]
["Safety","First Aid","Restricted Duty / Doctor Visit","Recordable","Lost Time","Major injury or death"]
[]
["Risk Response Strategies"]
["Threat Response","Description"]
["Escalate","Escalation is appropriate if the project sponsor agrees that a threat is outside the scope of the project or that the proposed response would exceed the PM's authority."]
["Avoid","Risk avoidance is when the team eliminates the threat or protects the project against its impact."]
{"$rows_left_out":16}
{"sheet":"Validation","index":4,"n_rows":11,"n_cols":9,"rows_kept":11}
["Category",null,"Classification",null,"Rank",null,"Strategy",null,"Status"]
["Business",null,"Opportunity (O)",null,-5,null,"Escalate (T&O)",null,"Inactive"]
["Community",null,"Threat (T)",null,-4,null,"Avoid (T)",null,"Accelerating"]
["Construction",null,"Both (T&O)",null,-3,null,"Transfer (T)",null,"Active"]
["Design",{"$nulls":3},-2,null,"Mitigate (T)",null,"Ceased"]
["Environment",{"$nulls":3},-1,null,"Accept (T&O)"]
["External",{"$nulls":3},1,null,"Exploit (O)"]
["Health & Safety",{"$nulls":3},2,null,"Share (O)"]
["Logistics",{"$nulls":3},3,null,"Enhance (O)"]
["Organizational",{"$nulls":3},4]
["Project Management",{"$nulls":3},5]